{"text_format":"1","workbook":"xlsx","n_sheets":8,"sheets":["Summary","x","Coverage Analysis","CA Data-Validation","Effort","Visit Cost","Fees-Invoiceables","QQBR"],"not_rendered":{"charts":0,"images":1,"macros":1,"external_links":0,"defined_names":27,"comments":1,"pivot_tables":0},"unopened":[],"bounds":{"document_bytes":16777216,"sheet_cells":100000,"rows_first":2000,"rows_last":500,"rows_between":2000,"halvings":0,"cell_chars":16384,"cell_head_chars":4096},"cells_cut":0,"cells_raw":0,"read":"whole","date_system":"1900"}

{"sheet":"Summary","index":0,"n_rows":67,"n_cols":14,"rows_kept":67,"cut":false,"hidden":false,"merged":[[27,13,39,13],[52,13,130,13],[6,13,11,13],[13,13,15,13],[17,13,25,13],[41,13,49,13],[66,0,73,0],[8,1,8,11],[9,0,9,1],[9,2,9,5],[9,6,9,7],[9,8,9,11],[10,0,10,1],[10,2,10,5],[10,6,10,7],[10,8,10,11],[14,0,14,2],[14,3,14,5],[14,6,14,7],[14,9,14,11],[15,0,15,11],[13,0,13,2],[13,3,13,5],[13,8,13,11],[0,0,0,11],[1,0,1,11],[2,0,2,11],[3,0,3,11],[7,0,7,11],[5,10,5,11],[6,10,6,11],[5,3,5,5],[6,3,6,5],[5,7,5,8],[6,7,6,8],[5,0,5,2],[6,0,6,2],[16,0,16,11],[11,0,11,1],[11,2,11,5],[11,6,11,7],[11,8,11,11],[12,0,12,2],[12,3,12,5],[12,6,12,7],[12,8,12,11],[13,6,13,7],[20,0,20,1],[20,2,20,3],[20,4,20,5],[20,7,20,8],[21,0,21,1],[21,2,21,3],[21,4,21,5],[21,7,21,8],[17,0,17,1],[17,2,17,3],[17,4,17,5],[17,7,17,8],[18,0,18,1],[18,2,18,3],[18,4,18,5],[18,7,18,8],[19,0,19,1],[19,4,19,5],[19,2,19,3],[19,7,19,8],[24,0,24,1],[24,2,24,3],[24,4,24,5],[24,7,24,8],[26,0,26,1],[26,2,26,3],[26,4,26,5],[26,7,26,8],[22,0,22,1],[22,2,22,3],[22,4,22,5],[22,7,22,8],[23,0,23,1],[23,2,23,3],[23,4,23,5],[23,7,23,8],[25,4,25,5],[25,2,25,3],[25,0,25,1],[25,7,25,8],[34,6,34,8],[34,9,34,10],[27,0,27,6],[27,7,27,8],[28,0,29,11],[30,0,30,5],[30,6,30,8],[31,0,31,5],[31,6,31,8],[32,9,32,10],[35,9,35,10],[36,0,36,5],[37,7,37,9],[38,7,38,9],[39,7,39,9],[40,0,40,5],[4,3,4,5],[4,0,4,2],[56,6,62,6],[56,1,62,5],[56,0,62,0],[51,0,55,11],[56,7,62,11],[41,0,41,5],[41,6,41,11],[42,0,42,5],[42,6,42,11],[43,0,44,11],[45,0,50,11],[32,0,32,5],[33,0,33,5],[33,6,33,8],[33,9,33,10],[34,0,34,5]]}
["The University of Texas Health Science Center at Houston"]
["Clinical Trials Detailed Budget Worksheet "]
["THIS FILE IS FOR INTERNAL USE ONLY. CONTACT CRF@uth.tmc.edu WITH ANY COMMENTS OR QUESTIONS"]
["Version  08/19/2026"]
[]
["Date:",null,null,null,null,null,"Coverage Analysis Complete By:",null,null,"Complexity",null,null,null,"Study Information"]
["Budget Complete By:",null,null,null,null,null,"Email",null,null,"Est. Project Period (include all yrs):","MM/DD/YYYY - MM/DD/YYYY",null,null,"•  Personnel are automatically populated from the Summary tab, across all sheets.  Please add additional personnel on the Summary tab.\n•  Complete all Yellow cells  \nStep 1: Complete the Project Information\nStep 2: Complete the salary amount for the personnel that will work on the project.  If multiple staff are on the project, use the highest salary among the staff.\nStep 3: The Fringe Rate is a tiered calculation."]
["PROJECT INFORMATION:  Enter the information below."]
["Project Title:","title"]
["Principal Investigator:",null,"PI",null,null,null,"Department:",null,"SPA"]
["Sponsor:",null,"Spon",null,null,null,"CRO:",null,"CRO"]
["CPHS Study Number:",null,"IRB num",null,null,null,"Primary Coordinator Name:",null,"NAME"]
["Pre-screen (Est # of Charts)",null,null,"1",null,null,"IDE #:",null,"IDE num",null,null,null,null,"Screening and Enrollment"]
["Screen Fail (Est. # of Participants)",null,null,1,null,null,"ClinicalTrials.gov # / NCT #:",null,"NCT number",null,null,null,null,"Example:  We will need to review about 250 charts (pre-screen) to identify and consent 25 (screen) that meet enrollment criteria to enroll 10 (target enrollment) participants\nTarget Enrollment:  Enter the number of participants to be enrolled/completed at UTHealth Houston.\nScreen (Est. # of participants):  enter the number of participants expected to consent and complete the screening visit(s). (Include estimated screen fails.)  \nPre-Screen (Est # of charts/records):  Enter the estimated number of charts or other records to be reviewed to identify participants for potential study enrollment.  \n"]
["TARGET ENROLLMENT:",null,null,1,null,null,"IDC RATE: ",null,0.3,"Non-negotiable for all industry sponsors."]
{"$rows_left_out":53}
{"sheet":"x","index":1,"n_rows":44,"n_cols":7,"rows_kept":44,"cut":false,"hidden":true,"merged":[[0,0,0,2],[0,4,0,6]]}
["FY27 Benefit Tiers",null,null,null,"FY27 Benefit Tiers - Students"]
["min ","max","rate",null,"min ","max","rate"]
[0,39999,0.55000000000000004,null,0,4999,0.09]
[40000,69999,0.46,null,5000,14999,0.51]
[70000,149999,0.35,null,15000,29999,0.53]
[150000,199999,0.28999999999999998,null,30000,"+",0.34]
[200000,299999,0.25]
[300000,349999,0.23]
[350000,499999,0.2]
[500000,599999,0.16]
[600000,"+",0.13]
[]
[]
[]
[]
{"$rows_left_out":30}
{"sheet":"Coverage Analysis","index":2,"n_rows":72,"n_cols":39,"rows_kept":72,"cut":false,"hidden":false,"merged":[[1,2,1,3],[1,0,1,1],[2,0,2,1],[4,0,4,1],[5,0,5,1],[3,0,3,1]]}
[]
[{"$f":"Summary!A9","v":"Project Title:"},null,{"$f":"Summary!B9","v":"title"}]
[{"$f":"Summary!A10","v":"Principal Investigator:"},null,{"$f":"Summary!C10","v":"PI"}]
[{"$f":"Summary!A11","v":"Sponsor:"},null,{"$f":"Summary!C11","v":"Spon"}]
[{"$f":"Summary!A12","v":"CPHS Study Number:"},null,{"$f":"Summary!C12","v":"IRB num"}]
[{"$f":"Summary!A13","v":"Pre-screen (Est # of Charts)"},null,{"$f":"Summary!D13","v":"1"},null,null,null,null,null,null,null,null,null,null,null,null,null,null,null,null,null,null,null,null,null,null,null,null,null,null,null,null,null,null,null,null,null,null,"Version Date:",{"$f":"LastSavedTimeStamp()","v":"2026-08-19T10:45:01"}]
[]
["Category ","Procedures/ Activities","Location ","CPT Code","CDM Code","V1","V2","V3","V4","V5","V6","V7","V8","V9","V10","V11","V12","V13","V14","V15","V16","V17","V18","V19","V20","V21","V22","V23","V24","V25","V26","V27","V28","V29","V30","V31","V32","V33","Justifications "]
[]
[]
[]
[]
[]
[]
[]
{"$rows_left_out":58}
{"sheet":"CA Data-Validation","index":3,"n_rows":489,"n_cols":21,"rows_kept":489,"cut":false,"hidden":true,"merged":[]}
["Patient Payment","Visits","Labs        ","Anesthesiology","XRay Imaging","Tissue ","Ultrasound ","CT","MRI MRA","Nuclear Radiology","EKG ECHO","Pulmonary","Pharmacy","Parking","Cardiac","OR","Biopsy","Fluoroscopy","PET","Neurophysiology","Other"]
["Patient Payment","Clinic Visit_Est. Patient Level 1","Albumin Serum","Anes Endotracheal Tube","Abdomen Acute Series Complete","Research Handling Fee- blocks","US Abdomen Complete","Creatinine Blood Non OPID-*only use with Contrast for CT","Creatinine Blood Non OPID-*only use with Contrast for MRI","Bone Density DXA Axial Skelet","Cable ECG 12 V Lead","6 min walk","New Study Set-Up / Administrative Fee (Inpatient Study)","CRU Parking ","Angio Coronary w/o Heart Cath","Cable ECG 12 V Lead","EKG Hourly Monitor Charge","Fluoro Local  NDL Biopsy/ Aspiration","CT Thorax W/O Contrast","13 or more Nerve Conduct","Other"]
[null,"Clinic Visit_New Patient Level 2","Alk Phosphatase","Anes srvs General 1st 30 min","Abdomen AP View","Research Unstained Slides","US Abdomen Limited","OPID CT Omnipaque 300ML 10-*only use with CT and Angio Contrast","IV START PAK-*only use with Contrast for MRI","Bone Scan Three Phase Study","ECG 12/15 Lead","Alprazolam 1 MG Tab","New Study Set-Up / Administrative Fee  (Outpatient Study)",null,"Blood O2 Saturation only","Cardiac Output Measurement","Conscious Sedation> 5 years old, first 30 min",null,"PET Brain Imaging Met Eval"]
[null,"Clinic Visit_New Patient Level 3","Alpha -fetoprotein","Anes srvs General add 15 mins","Ankle 2 Views Bilateral",null,"US Brain Scan","Iodixanol 320MG/ML INJ(200ML)- *only use with CT and Angio Contrast","Electrode MRI ECG Quatrade-*only use with Contrast for MRI","Bone Scan Tomogram Spect","12 Lead ECG CPT (Tracing & Interpretation only)","Blood Gas","Annual Refrig Storage Fee",null,"Cath Lab Treatment Room","Cath 8F Cardiac Output","Skin biopsy + add  Lesion",null,"PET CT Tumor Image Skull MIDTH"]
[null,"Clinic Visit_ Est. Patient Level 4","ALT (SGPT)","Desflurane Per case","Ankle 2 Views Unilateral",null,"US Chest","Injection Kit Dual Syringe-*only use with Contrast for CT","Monitor Non-Invasive","Bone Scan Whole Body","ECG Rhythym Strip","Blood O2 Saturation","Annual Study Maintenance Fee",null,"DSA Analysis Coronary","Drape Intraop Probe SM T TIP","Oxygen ",null,"PET CT Tumor Imaging LTD area"]
[null,"Clinic Visit_ Est. Patient Level 5","Amplified Probe(MSRA)","Invasive Pressure Monitor","Ankle Complete 3+V Uni",null,"US Duplex Abd/Pel/Scrot/Kid","CT Abdomen w/Contrast","MRI Kit-*only use with Contrast for MRI","Bone Scan Whole Body","Echo 2D M Mode Comp w/Color Fl","Bronchoscopy w/Biopsy","Miscellaneous IDS FEE 15 min",null,"DSA Analysis LV Gram","Dressing Bio Patch","Biopsy Tray",null,"PET CT Tumor Imaging Whole BD"]
[null,"Room Charge","AST (SGOT)","Kit Transd 3 ml 12 in 72 in TB","Bone Density DXA Axial Skelet",null,"US Duplex Ext Veins Bilat","CT Abdomen w/out Contrast","GADOBENATE 1ML VL(7935MG/15ML)-*(contrast x 15 (qty 15= qty is equal to 1ML VL (7935MG/15ML) per 150 lb patient)  only use with Contrast for MRI","Bone Scan, Multiple Area","Echo 2D M Mode Complete","Bronchoscopy w/Bronchial Lavag","Patient Randomization",null,"Injection Venous Bypass Grafts","Injection IV Push 1st drug","Universal Precautions",null,"PET Myocard Imag Metabolic Eval"]
[null,"Venipuncture","Basic Metabolic Panel","Oximeter P/Day","Bone Survey Complete",null,"US Pelvis Complete","CT Abodomen w/out - w/Contrast","MRA Abdomen w/Contrast","Brain Scan Spect","Echo 2D M Mode Limited","Bronchoscopy w/Brushing","Per Dose RX Dispensing Fee",null,"Left & Right Heart Cath","Kit Perc Intro 8.5 FR","Pulse Oximeter",null,"PET Myocard Imag Metabolic Eval"]
[null,null,"Beta-Natriuretic Peptide (BNP)",null,"Both Knees standing anteroposterior",null,"US Retroperitoneal Limited","CT Angio Abdomen","MRA Abdomen w/out Contrast","Cardiac Scan Gated Multi(MUGA)","Echo Doppler Complete","Cardiac Output Measurement","Storage Of Used Study Medication",null,"Procedure Prep","Minor Proc Recovery  1 st hour","Biopsy Lung perc",null,"PET Tumor Image Skull Midthigh"]
[null,null,"Bicarbonate(CO2)",null,"Chest AP w/Fluoro",null,"US Scrotum & Contents","CT Angio Aorta w/Fem Runoff","MRA Abdoment w/out - w/Contrast","Cold Pyrophosphate per dose","Echo Doppler Limited","D5W 500 ml Bag","Study Annual Documentation Fee",null,"S&I Abdominal Aortagram","Minor Proc Recovery  add 30 minutes ","Skin biopsy Single Lesion",null,"PET Tumor Imaging"]
[null,null,"Bilirubin Direct",null,"Chest AP w/Lordotic",null,"US Transpl Kidney w/ Dop","CT Angio Chest w/o - w/Contrast","MRA Chest w/Contrast","Lung Perfusion Scan","Echo Follow-Up Congenital","Diffusion Capacity (DLCO)",null,null,"S&I Arterial /Vent/Angio ( Pedi)","Oxi Adult Sensor","Kit Bone Biopsy",null,"PET Tumor Imaging Limited area"]
[null,null,"Bilirubin Total",null,"Chest 2 view AP & Lateral",null,"US Transpl Kidney w/out Dop","CT Angio Extr Lower w/Contrast Uni","MRA Chest w/out - w/Contrast","TC-99M Sulfur Colloid Per Dose","Echo Follow-Up/Limited","Fentanyl 100 MCG/2 ml Vl",null,null,"S&I Cor/Pulm/Aort Angio","Pack Line Linen","Pressure bag vital signs",null,"PET Tumor Imaging Whole Body"]
[null,null,"Blood Culture",null,"Chest AP Single View",null,"US Transrectal","CT Angio Extr Lower w/o - w/Bi","MRA Head w/Contrast",null,"Echo w/Contrast","Injection  Internal Mammary",null,null,null,"Phase 2 PACU Ea Add 30 min-Rout","IV Catheter #18-24"]
[null,null,"BUN",null,"Knee 1 or 2 views",null,"US Transvaginal","CT Angio Extr Upper w/Contrast Bi","MRA Head w/out - w/Contrast",null,"Holter Analysis","Injection Pulmonary",null,null,null,"Preoperative Assessment","Conscious Sedation> 5 years old, each add 15 mins"]
[null,null,"Calcium Ionized",null,"Knee 3 views",null,null,"CT Angio Extr Upper w/Contrast Uni","MRA Head w/out Contrast",null,"Holter Placement 24 Hour","Midazolam 1 MG vl (2mg/2ml)",null,null,null,"Pressure Infuse disposable","Monitors electrodes"]
{"$rows_left_out":475}
{"sheet":"Effort","index":4,"n_rows":85,"n_cols":38,"rows_kept":85,"cut":false,"hidden":false,"merged":[[83,0,83,4],[81,1,81,4],[84,0,84,4],[77,1,77,4],[78,1,78,4],[79,1,79,4],[80,1,80,4],[82,1,82,4],[72,0,72,1],[73,0,74,0],[73,1,74,4],[75,1,75,4],[76,1,76,4],[67,0,67,4],[68,0,68,1],[69,0,69,1],[70,0,70,1],[71,0,71,1],[65,1,65,4],[65,22,65,23],[64,1,64,4],[64,22,64,23],[66,1,66,4],[66,22,66,23],[57,0,58,0],[57,1,58,4],[62,1,62,4],[62,22,62,23],[63,1,63,4],[63,22,63,23],[61,22,61,23],[57,22,58,23],[59,1,59,4],[59,22,59,23],[60,1,60,4],[60,22,60,23],[61,1,61,4],[55,5,57,6],[95,0,95,1],[2,0,2,1],[3,0,3,1],[0,0,0,1],[1,0,1,1],[37,0,37,1],[5,0,6,1],[10,0,10,1],[14,0,14,1],[12,0,12,1],[24,0,24,1],[23,0,23,1],[44,0,44,3],[38,2,38,3],[40,0,40,1],[40,2,40,3],[36,0,36,1],[36,2,36,3],[27,0,27,3],[33,0,34,1],[33,2,34,3],[35,0,35,1],[35,2,35,3],[25,2,25,3],[41,0,41,1],[41,2,41,3],[38,0,38,1],[42,0,42,1],[42,2,42,3],[43,0,43,3],[39,0,39,1],[24,37,24,38],[17,37,18,38],[19,37,19,38],[20,37,20,38],[21,37,21,38],[22,37,22,38],[23,37,23,38],[25,37,25,38],[26,37,26,38],[7,0,7,1],[7,2,7,3],[9,0,9,1],[9,2,9,3],[37,2,37,3],[17,2,18,3],[17,0,18,1],[19,0,19,1],[19,2,19,3],[20,0,20,1],[20,2,20,3],[21,2,21,3],[22,2,22,3],[24,2,24,3],[8,0,8,1],[8,2,8,3],[26,2,26,3],[25,0,25,1],[26,0,26,1],[14,4,14,5],[15,4,15,5],[10,2,10,3],[11,0,11,1],[11,2,11,3],[13,0,13,1],[23,2,23,3],[39,2,39,3],[12,2,12,3],[14,2,14,3],[21,0,21,1],[22,0,22,1],[15,0,15,1],[15,2,15,3],[8,4,8,5],[13,2,13,3],[5,2,6,3],[12,4,12,5],[5,4,6,5],[7,4,7,5],[9,4,9,5],[10,4,10,5],[11,4,11,5],[13,4,13,5]]}
[{"$f":"Summary!A9","v":"Project Title:"},null,{"$f":"Summary!B9","v":"title"}]
[{"$f":"Summary!A10","v":"Principal Investigator:"},null,{"$f":"Summary!C10","v":"PI"}]
[{"$f":"Summary!A11","v":"Sponsor:"},null,{"$f":"Summary!C11","v":"Spon"}]
[{"$f":"Summary!A12","v":"CPHS Study Number:"},null,{"$f":"Summary!C12","v":"IRB num"}]
[]
["Position ",null,"Name ",null,"Hourly Rate"]
[]
[{"$f":"Summary!A19","v":"PI"},null,{"$f":"IF(Summary!C19=0,\"\",Summary!C19)","v":"PI"},null,{"$f":"((Summary!$E$19+ (Summary!$E$19*Summary!$J$19))/2080)","v":0},{"$f":"((Summary!$E$19+ (Summary!$E$19*Summary!$J$19))/2080)*#REF!","v":{"$error":"#REF!"}}]
[{"$f":"Summary!A20","v":"PI Oversight"},null,{"$f":"IF(Summary!C20=0,\"\",Summary!C20)","v":"PI"},null,{"$f":"((Summary!$E$20+ (Summary!$E$20*Summary!$J$20))/2080)","v":0},{"$f":"((Summary!$E$19+ (Summary!$E$19*Summary!$J$19))/2080)*#REF!","v":{"$error":"#REF!"}}]
[{"$f":"Summary!A21","v":"Coordinator"},null,{"$f":"IF(Summary!C21=0,\"\",Summary!C21)","v":"NAME"},null,{"$f":"((Summary!$E$21+ (Summary!$E$21*Summary!$J$21))/2080)","v":0},{"$f":"((Summary!$E$19+ (Summary!$E$19*Summary!$J$19))/2080)*#REF!","v":{"$error":"#REF!"}}]
[{"$f":"Summary!A22","v":"Coordinator Admin"},null,{"$f":"IF(Summary!C22=0,\"\",Summary!C22)","v":"NAME"},null,{"$f":"((Summary!$E$22+ (Summary!$E$22*Summary!$J$22))/2080)","v":0},{"$f":"((Summary!$E$19+ (Summary!$E$19*Summary!$J$19))/2080)*#REF!","v":{"$error":"#REF!"}},null,"Note-- Effort  per person for each visit should include visit preparation and visit administration time and effort too."]
[{"$f":"Summary!A23","v":"Financial Management"},null,{"$f":"IF(Summary!C23=0,\"\",Summary!C23)","v":""},null,{"$f":"((Summary!$E$23+ (Summary!$E$23*Summary!$J$23))/2080)","v":0},{"$f":"((Summary!$E$19+ (Summary!$E$19*Summary!$J$19))/2080)*#REF!","v":{"$error":"#REF!"}},null,"Example- Chart set up, scheduling next visit, escorting participant for imaging, data entry into CRF, etc."]
[{"$f":"Summary!A24","v":0},null,{"$f":"IF(Summary!C24=0,\"\",Summary!C24)","v":""},null,{"$f":"((Summary!$E$24+ (Summary!$E$24*Summary!$J$24))/2080)","v":0},{"$f":"((Summary!$E$19+ (Summary!$E$19*Summary!$J$19))/2080)*#REF!","v":{"$error":"#REF!"}}]
[{"$f":"Summary!A25","v":0},null,{"$f":"IF(Summary!C25=0,\"\",Summary!C25)","v":""},null,{"$f":"((Summary!$E$25+ (Summary!$E$25*Summary!$J$25))/2080)","v":0},{"$f":"((Summary!$E$19+ (Summary!$E$19*Summary!$J$19))/2080)*#REF!","v":{"$error":"#REF!"}},null,"Financial Management - Minimum .5 per visit for invoicing and/or payment reconciliation & 3 hours for last visit  for study reconciliation. (In some cases this is also the study coordinator. However the time spent for financial management is separate from and in addition to the time and effort spent during study visits therefore needs to be captured separately. "]
[{"$f":"Summary!A26","v":0},null,{"$f":"IF(Summary!C26=0,\"\",Summary!C26)","v":""},null,{"$f":"((Summary!$E$26+ (Summary!$E$26*Summary!$J$26))/2080)","v":0},{"$f":"((Summary!$E$19+ (Summary!$E$19*Summary!$J$19))/2080)*#REF!","v":{"$error":"#REF!"}},null,"Regulatory Management- Minimum .25 per visit and 3 hours for last study visit to capture continuing reviews, and amendment processing  . (In many cases the study coordinator also manages regulatory. However the time spent managing regulatory documents (SAE, Reg Binder, IND report management, IRB submissions) is separate from and in addition to the time and effort spent during study visits therefore needs to be captured separately.  "]
{"$rows_left_out":71}
{"sheet":"Visit Cost","index":5,"n_rows":84,"n_cols":35,"rows_kept":84,"cut":false,"hidden":false,"merged":[[4,0,4,1],[1,0,1,1],[2,0,2,1],[3,0,3,1]]}
[]
[{"$f":"Summary!A10","v":"Principal Investigator:"},null,{"$f":"Summary!C10","v":"PI"}]
[{"$f":"Summary!A11","v":"Sponsor:"},null,{"$f":"Summary!C11","v":"Spon"}]
[{"$f":"Summary!A12","v":"CPHS Study Number:"},null,{"$f":"Summary!C12","v":"IRB num"}]
[{"$f":"Summary!A13","v":"Pre-screen (Est # of Charts)"},null,{"$f":"Summary!D13","v":"1"}]
[]
[]
[]
[]
[]
[null,"Clinical Cost"]
[null,"Procedures/Activities",{"$f":"'Coverage Analysis'!F8","v":"V1"},{"$f":"'Coverage Analysis'!G8","v":"V2"},{"$f":"'Coverage Analysis'!H8","v":"V3"},{"$f":"'Coverage Analysis'!I8","v":"V4"},{"$f":"'Coverage Analysis'!J8","v":"V5"},{"$f":"'Coverage Analysis'!K8","v":"V6"},{"$f":"'Coverage Analysis'!L8","v":"V7"},{"$f":"'Coverage Analysis'!M8","v":"V8"},{"$f":"'Coverage Analysis'!N8","v":"V9"},{"$f":"'Coverage Analysis'!O8","v":"V10"},{"$f":"'Coverage Analysis'!P8","v":"V11"},{"$f":"'Coverage Analysis'!Q8","v":"V12"},{"$f":"'Coverage Analysis'!R8","v":"V13"},{"$f":"'Coverage Analysis'!S8","v":"V14"},{"$f":"'Coverage Analysis'!T8","v":"V15"},{"$f":"'Coverage Analysis'!U8","v":"V16"},{"$f":"'Coverage Analysis'!V8","v":"V17"},{"$f":"'Coverage Analysis'!W8","v":"V18"},{"$f":"'Coverage Analysis'!X8","v":"V19"},{"$f":"'Coverage Analysis'!Y8","v":"V20"},{"$f":"'Coverage Analysis'!Z8","v":"V21"},{"$f":"'Coverage Analysis'!AA8","v":"V22"},{"$f":"'Coverage Analysis'!AB8","v":"V23"},{"$f":"'Coverage Analysis'!AC8","v":"V24"},{"$f":"'Coverage Analysis'!AD8","v":"V25"},{"$f":"'Coverage Analysis'!AE8","v":"V26"},{"$f":"'Coverage Analysis'!AF8","v":"V27"},{"$f":"'Coverage Analysis'!AG8","v":"V28"},{"$f":"'Coverage Analysis'!AH8","v":"V29"},{"$f":"'Coverage Analysis'!AI8","v":"V30"},{"$f":"'Coverage Analysis'!AJ8","v":"V31"},{"$f":"'Coverage Analysis'!AK8","v":"V32"},{"$f":"'Coverage Analysis'!AL8","v":"V33"}]
[null,{"$f":"IF(ISBLANK('Coverage Analysis'!B9),\"\",'Coverage Analysis'!B9)","v":""}]
[null,{"$f":"IF(ISBLANK('Coverage Analysis'!B10),\"\",'Coverage Analysis'!B10)","v":""}]
[null,{"$f":"IF(ISBLANK('Coverage Analysis'!B11),\"\",'Coverage Analysis'!B11)","v":""}]
{"$rows_left_out":70}
{"sheet":"Fees-Invoiceables","index":6,"n_rows":44,"n_cols":11,"rows_kept":44,"cut":false,"hidden":false,"merged":[[10,0,10,2],[43,0,43,2],[16,0,16,2],[17,0,17,2],[14,0,14,2],[15,0,15,2],[13,0,13,2],[11,0,11,2],[12,0,12,2],[9,0,9,2],[0,0,0,1],[0,2,0,11],[1,0,1,1],[1,2,1,11],[2,0,2,1],[2,2,2,11],[4,0,4,2],[5,0,5,2],[6,0,6,2],[7,0,7,2],[8,0,8,2]]}
[{"$f":"Summary!A9","v":"Project Title:"},null,{"$f":"Summary!B9","v":"title"}]
[{"$f":"Summary!A10","v":"Principal Investigator:"},null,{"$f":"Summary!C10","v":"PI"}]
[{"$f":"Summary!A12","v":"CPHS Study Number:"},null,{"$f":"Summary!C12","v":"IRB num"}]
[]
["Start Up Costs",null,null,"Total ","Total W IDC"]
["Start Up Effort",null,null,{"$f":"IF(Effort!W84=0,\"\",Effort!W84)","v":""},{"$f":"IF(Effort!W85=0,\"\",Effort!W85)","v":""}]
["IRB Review Fee - Local or Permission to Rely",null,null,2000,{"$f":"IF(D7=0, \"\",D7*1.3)","v":2600},null,null,null,null,"Coverage Analysis Fees -  for  Industry  and Departmentally Sponsored studies (inclusive of IDC)"]
["Coverage Analysis Fee",null,null,{"$f":"E8/1.3","v":{"$error":"#VALUE!"}},{"$f":"IF(Summary!K6='Fees-Invoiceables'!J8,'Fees-Invoiceables'!K8,IF(Summary!K6='Fees-Invoiceables'!J9,'Fees-Invoiceables'!K9,IF(Summary!K6='Fees-Invoiceables'!J10,'Fees-Invoiceables'!K10,\"\")))","v":""},null,null,null,null,"Low",2069]
["Investigational Pharmacy Setup Fee (Delete if N/A)",null,null,null,null,null,null,null,null,"Medium",3448]
["MHH Adminsitrative Start up Fee (Delete if N/A)",null,null,null,{"$f":"IF(D10=0, \"\",D10*1.3)","v":""},null,null,null,null,"High",4285]
["Radiology Dept Setup Fee (Delete if N/A)",null,null,null,"",null,null,null,null,"Complex",4820]
["CRU Start up Fee (Delete if N/A)",null,null,null,""]
["Lab set up Fee (Delete if N/A)",null,null,null,""]
[null,null,null,null,"",null,null,null,null," Effective 01/01/24  IRB fee is $2600  (inclusive of IDC)  regardless of whether or not the study is requesting full board review or requesting permission to rely on outside IRB"]
[null,null,null,null,""]
{"$rows_left_out":30}
{"sheet":"QQBR","index":7,"n_rows":45,"n_cols":14,"rows_kept":45,"cut":false,"hidden":false,"merged":[[16,0,16,11],[10,7,10,11],[7,0,7,11],[8,0,8,11],[2,8,2,11],[3,2,3,5],[3,6,3,7],[3,8,3,11],[4,6,4,7],[4,8,4,11],[3,0,3,1],[4,0,4,1],[2,0,2,1],[2,2,2,5],[2,6,2,7],[11,0,11,6],[11,7,11,11],[12,0,12,6],[12,7,12,11],[9,0,10,6],[9,7,9,11],[13,0,13,6],[13,7,13,11],[15,0,15,11],[14,0,14,6],[14,7,14,11],[18,0,18,11],[20,0,20,6],[20,7,20,11],[17,0,17,6],[17,7,17,11],[19,0,19,11],[21,0,21,6],[21,7,21,11],[22,0,22,6],[22,7,22,11],[23,0,23,6],[23,7,23,11],[1,1,1,11],[4,2,4,5],[5,0,5,2],[5,3,5,5],[5,6,5,7],[5,8,5,11],[32,0,32,9],[33,0,33,9],[24,0,24,11],[26,0,26,9],[27,0,27,9],[28,0,28,9],[14,13,20,19],[6,0,6,2],[6,3,6,5],[45,0,50,9],[34,0,34,9],[35,0,35,9],[36,0,36,9],[37,0,37,9],[38,0,38,9],[39,0,39,9],[40,0,40,9],[41,0,41,9],[44,0,44,9],[29,0,29,9],[30,0,30,9],[31,0,31,9]]}
[]
["Project Title:",{"$f":"Summary!B9","v":"title"}]
["Principal Investigator:",null,{"$f":"Summary!C10","v":"PI"},null,null,null,"Department:",null,{"$f":"Summary!I10","v":"SPA"}]
["Sponsor/CRO:",null,{"$f":"Summary!C11","v":"Spon"},null,null,null,"Project Period:",null,{"$f":"Summary!I11","v":"CRO"}]
["CPHS Study Number:",null,{"$f":"Summary!C12","v":"IRB num"},null,null,null,"Coordinator:",null,{"$f":"Summary!I12","v":"NAME"}]
["ClinicalTrials.gov # / NCT #:",null,null,{"$f":"Summary!D13","v":"1"},null,null,"IDE #:",null,{"$f":"Summary!I13","v":"IDE num"}]
["Coverage Analysis Version Date:",null,null,{"$f":"'Coverage Analysis'!AM6","v":"2026-08-19T10:45:01"}]
[]
["Device Studies"]
["What type of device is being studied?"]
[]
["Is the investigational product provided for free by sponsor?"]
["If IDE, has the device “packet” been sent to CMS for approval?"]
["Has it been approved by CMS for billing?"]
["Has the MHH device checklist been completed?",null,null,null,null,null,null,null,null,null,null,null,null,"A DEEMED study is one that meets one of the following criteria:\n\n1. Trials funded by NIH, CDC, AHRQ, CMS, DOD or VA.\n2. Trials supported by centers or cooperative groups that are funded by the NIH, CDC, AHRQ, CMS, DOD or VA.\n3. Trials conducted under an investigational new drug application (IND) reviewed by the FDA.\n4. Drug trials that  are exempt from having an IND under 21 CFR 312.2(b)(1)."]
{"$rows_left_out":30}